Target
Carbonic anhydrase 9
Ligand
BDBM50457335
Substrate
Meas. Tech.
ChEMBL_1759338 (CHEMBL4194346)
Ki
4.8±n/a nM
Citation
 Angeli, ATanini, DPeat, TSDi Cesare Mannelli, LBartolucci, GCapperucci, AGhelardini, CSupuran, CTCarta, F Discovery of New Selenoureido Analogues of 4-(4-Fluorophenylureido)benzenesulfonamide as Carbonic Anhydrase Inhibitors. ACS Med Chem Lett 8:963-968 (2017)  
Target
Name:
Carbonic anhydrase 9
Synonyms:
CA-IX CAH9_HUMAN Carbonic anhydrase 9 (CA IX) Carbonic anhydrase 9 precursor Carbonic anhydrase IX (CAIX) Carbonic anhydrases; II & IX MN RCC-associated antigen G250
Type:
Enzyme
Mol. Mass.:
49669.03
Organism:
Homo sapiens (Human)
Description:
Catalytic domain of human cloned isozyme was used in the assay
Residue:
459
  
Inhibitor
Name:
BDBM50457335
Synonyms:
CHEMBL4218419
Type:
Small organic molecule
Emp. Form.:
C15H16ClN3O2SSe
Mol. Mass.:
416.78
SMILES:
[#7]S(=O)(=O)c1ccc(-[#6]-[#6]-[#7]-[#6](=[Se;v2])-[#7]-c2ccccc2Cl)cc1
: