Target
5-hydroxytryptamine receptor 2A
Ligand
BDBM22875
Substrate
Meas. Tech.
ChEMBL_1760113 (CHEMBL4195121)
Ki
50±n/a nM
Citation
 Pa?czyk, KPytka, KJakubczyk, MRapacz, ASa?at, KFurga?a, ASiwek, AG?uch-Lutwin, MGrybo?, AS?oczy?ska, KP?kala, E?mudzki, PBucki, AKo?aczkowski, M?elaszczyk, DMarona, HWaszkielewicz, AM Synthesis and activity of di- or trisubstituted N-(phenoxyalkyl)- or N-{2-[2-(phenoxy)ethoxy]ethyl}piperazine derivatives on the central nervous system. Bioorg Med Chem Lett 28:2039-2049 (2018)  
Target
Name:
5-hydroxytryptamine receptor 2A
Synonyms:
5-HT-2 5-HT2A 5-hydroxytryptamine receptor 2A (5HT-2A) 5HT2A_HUMAN HTR2A | Serotonin receptor 2A
Type:
undefined
Mol. Mass.:
52607.65
Organism:
Homo sapiens (Human)
Description:
P28223
Residue:
471
  
Inhibitor
Name:
BDBM22875
Synonyms:
2-(2-{4-[(4-chlorophenyl)(phenyl)methyl]piperazin-1-yl}ethoxy)ethan-1-ol CHEMBL896 Hydroxyzine Hydroxyzine, (R) Vistaril | med.21724, Compound 187
Type:
Small organic molecule
Emp. Form.:
C21H27ClN2O2
Mol. Mass.:
374.904
SMILES:
OCCOCCN1CCN(CC1)C(c1ccccc1)c1ccc(Cl)cc1
: