Target
Ectonucleotide pyrophosphatase/phosphodiesterase family member 2
Ligand
BDBM50458125
Substrate
Meas. Tech.
ChEMBL_1762373 (CHEMBL4197620)
IC50
136±n/a nM
Citation
 Balupuri, ALee, MHChae, SJung, EYoon, WKim, YSon, SJRyu, JKang, DHYang, YJYou, JNKwon, HJeong, JWKoo, TSLee, DYKang, NS Discovery and optimization of ATX inhibitors via modeling, synthesis and biological evaluation. Eur J Med Chem 148:397-409 (2018)  
Target
Name:
Ectonucleotide pyrophosphatase/phosphodiesterase family member 2
Synonyms:
ATX Autotaxin (ATX) ENPP2 Ectonucleotide Pyrophosphatase/Phosphodiesterase 2 (ENPP2) Extracellular lysophospholipase D PDNP2
Type:
Enzyme
Mol. Mass.:
99007.13
Organism:
Homo sapiens (Human)
Description:
Q13822
Residue:
863
  
Inhibitor
Name:
BDBM50458125
Synonyms:
CHEMBL4217352
Type:
Small organic molecule
Emp. Form.:
C21H23Cl2N2O6P
Mol. Mass.:
501.297
SMILES:
OP(O)(=O)Cc1ccc(NC(=O)C2CCN(CC2)C(=O)OCc2cc(Cl)cc(Cl)c2)cc1
: