Target
Opioid receptor delta 1
Ligand
BDBM50018731
Substrate
Meas. Tech.
ChEMBL_1762407 (CHEMBL4197654)
Ki
1.1±n/a nM
Citation
 Turnaturi, RMarrazzo, AParenti, CPasquinucci, L Benzomorphan scaffold for opioid analgesics and pharmacological tools development: A comprehensive review. Eur J Med Chem 148:410-422 (2018)  
Target
Name:
Opioid receptor delta 1
Synonyms:
G_PROTEIN_RECEP_F1_2 domain-containing protein | OPRD1
Type:
PROTEIN
Mol. Mass.:
40087.02
Organism:
Cavia porcellus
Description:
ChEMBL_117772
Residue:
366
  
Inhibitor
Name:
BDBM50018731
Synonyms:
(Cyclazocine) 3-Cyclopropylmethyl-6,11-dimethyl-1,2,3,4,5,6-hexahydro-2,6-methano-benzo[d]azocin-8-ol 10-cyclopropylmethyl-1,13-dimethyl-10-azatricyclo[7.3.1.02,7]trideca-2(7),3,5-trien-4-ol(Cyclazocine) 3-Cyclopropylmethyl-6,11-dimethyl-1,2,3,4,5,6-hexahydro-2,6-methano-benzo[d]azocin-8-ol(Cyclazocine) CYCLAZOCINE (-) | Cyclazocine (+)
Type:
Small organic molecule
Emp. Form.:
C18H25NO
Mol. Mass.:
271.3972
SMILES:
CC1C2Cc3ccc(O)cc3C1(C)CCN2CC1CC1
: