Target
Serine-protein kinase ATM
Ligand
BDBM50459004
Substrate
Meas. Tech.
ChEMBL_1765222 (CHEMBL4200469)
IC50
0.290000±n/a nM
Citation
 Barlaam, BCadogan, ECampbell, AColclough, NDishington, ADurant, SGoldberg, KHassall, LAHughes, GDMacFaul, PAMcGuire, TMPass, MPatel, APearson, SPetersen, JPike, KGRobb, GStratton, NXin, GZhai, B Discovery of a Series of 3-Cinnoline Carboxamides as Orally Bioavailable, Highly Potent, and Selective ATM Inhibitors. ACS Med Chem Lett 9:809-814 (2018)  
Target
Name:
Serine-protein kinase ATM
Synonyms:
A-T mutated ATM_HUMAN | Ataxia telangiectasia mutated
Type:
Protein
Mol. Mass.:
350696.72
Organism:
Homo sapiens (Human)
Description:
Q13315
Residue:
3056
  
Inhibitor
Name:
BDBM50459004
Synonyms:
CHEMBL4217549
Type:
Small organic molecule
Emp. Form.:
C26H34N6O3
Mol. Mass.:
478.5866
SMILES:
C[C@H](Nc1c(nnc2ccc(cc12)-c1ccc(OCCCN(C)C)nc1)C(N)=O)C1CCOCC1
: