Target
Serine-protein kinase ATM
Ligand
BDBM50459012
Substrate
Meas. Tech.
ChEMBL_1765209 (CHEMBL4200456)
IC50
44±n/a nM
Citation
 Barlaam, BCadogan, ECampbell, AColclough, NDishington, ADurant, SGoldberg, KHassall, LAHughes, GDMacFaul, PAMcGuire, TMPass, MPatel, APearson, SPetersen, JPike, KGRobb, GStratton, NXin, GZhai, B Discovery of a Series of 3-Cinnoline Carboxamides as Orally Bioavailable, Highly Potent, and Selective ATM Inhibitors. ACS Med Chem Lett 9:809-814 (2018)  
Target
Name:
Serine-protein kinase ATM
Synonyms:
A-T mutated ATM_HUMAN | Ataxia telangiectasia mutated
Type:
Protein
Mol. Mass.:
350696.72
Organism:
Homo sapiens (Human)
Description:
Q13315
Residue:
3056
  
Inhibitor
Name:
BDBM50459012
Synonyms:
CHEMBL4216325
Type:
Small organic molecule
Emp. Form.:
C23H25N7O2
Mol. Mass.:
431.4903
SMILES:
COCc1ccc(cn1)-c1ccc2nnc(C(N)=O)c(N[C@@H](C)c3nn(C)cc3C)c2c1
: