Target
Serine/threonine-protein kinase ATR
Ligand
BDBM50459017
Substrate
Meas. Tech.
ChEMBL_1765210 (CHEMBL4200457)
IC50
>30000±n/a nM
Citation
 Barlaam, BCadogan, ECampbell, AColclough, NDishington, ADurant, SGoldberg, KHassall, LAHughes, GDMacFaul, PAMcGuire, TMPass, MPatel, APearson, SPetersen, JPike, KGRobb, GStratton, NXin, GZhai, B Discovery of a Series of 3-Cinnoline Carboxamides as Orally Bioavailable, Highly Potent, and Selective ATM Inhibitors. ACS Med Chem Lett 9:809-814 (2018)  
Target
Name:
Serine/threonine-protein kinase ATR
Synonyms:
ATR Ataxia telangiectasia and Rad3-related protein (ATR) FRP1 | Serine-protein kinase ATR
Type:
Protein
Mol. Mass.:
301404.58
Organism:
Homo sapiens (Human)
Description:
Q13535
Residue:
2644
  
Inhibitor
Name:
BDBM50459017
Synonyms:
CHEMBL4205148
Type:
Small organic molecule
Emp. Form.:
C24H28N8O2
Mol. Mass.:
460.5315
SMILES:
C[C@H](Nc1c(nnc2ccc(cc12)-c1ccc(OCCN(C)C)nc1)C(N)=O)c1ccn(C)n1
: