Target
Serine/threonine-protein kinase ATR
Ligand
BDBM50459018
Substrate
Meas. Tech.
ChEMBL_1765210 (CHEMBL4200457)
IC50
>19000±n/a nM
Citation
 Barlaam, BCadogan, ECampbell, AColclough, NDishington, ADurant, SGoldberg, KHassall, LAHughes, GDMacFaul, PAMcGuire, TMPass, MPatel, APearson, SPetersen, JPike, KGRobb, GStratton, NXin, GZhai, B Discovery of a Series of 3-Cinnoline Carboxamides as Orally Bioavailable, Highly Potent, and Selective ATM Inhibitors. ACS Med Chem Lett 9:809-814 (2018)  
Target
Name:
Serine/threonine-protein kinase ATR
Synonyms:
ATR Ataxia telangiectasia and Rad3-related protein (ATR) FRP1 | Serine-protein kinase ATR
Type:
Protein
Mol. Mass.:
301404.58
Organism:
Homo sapiens (Human)
Description:
Q13535
Residue:
2644
  
Inhibitor
Name:
BDBM50459018
Synonyms:
CHEMBL4166405
Type:
Small organic molecule
Emp. Form.:
C23H23FN6O2
Mol. Mass.:
434.4661
SMILES:
COCc1ccc(cn1)-c1cc2c(N[C@@H](C)c3ccn(C)n3)c(cnc2cc1F)C(N)=O
: