Target
Phosphatidylinositol 4,5-bisphosphate 3-kinase catalytic subunit beta isoform
Ligand
BDBM50459003
Substrate
Meas. Tech.
ChEMBL_1765230 (CHEMBL4200477)
IC50
>19000±n/a nM
Citation
 Barlaam, BCadogan, ECampbell, AColclough, NDishington, ADurant, SGoldberg, KHassall, LAHughes, GDMacFaul, PAMcGuire, TMPass, MPatel, APearson, SPetersen, JPike, KGRobb, GStratton, NXin, GZhai, B Discovery of a Series of 3-Cinnoline Carboxamides as Orally Bioavailable, Highly Potent, and Selective ATM Inhibitors. ACS Med Chem Lett 9:809-814 (2018)  
Target
Name:
Phosphatidylinositol 4,5-bisphosphate 3-kinase catalytic subunit beta isoform
Synonyms:
PI3-kinase p110 subunit beta PI3Kbeta PIK3CB Phosphatidylinositol 4,5-bisphosphate 3-kinase catalytic subunit beta (PI3Kbeta) Phosphatidylinositol 4,5-bisphosphate 3-kinase catalytic subunit beta isoform (PI3K) Phosphatidylinositol 4,5-bisphosphate 3-kinase catalytic subunit beta isoform (PI3Kbeta) Phosphatidylinositol-4,5-bisphosphate 3-kinase catalytic subunit beta isoform Phosphoinositide 3-Kinase (PI3K), beta Chain A PtdIns-3-kinase p110
Type:
Enzyme Subunit
Mol. Mass.:
122769.00
Organism:
Homo sapiens (Human)
Description:
P42338
Residue:
1070
  
Inhibitor
Name:
BDBM50459003
Synonyms:
CHEMBL4218854
Type:
Small organic molecule
Emp. Form.:
C27H36N6O3
Mol. Mass.:
492.6131
SMILES:
CNC(=O)c1nnc2ccc(cc2c1N[C@@H](C)C1CCOCC1)-c1ccc(OCCCN(C)C)nc1
: