Target
Transthyretin
Ligand
BDBM50197885
Substrate
Meas. Tech.
ChEMBL_1765443 (CHEMBL4200690)
Kd
4.8±n/a nM
Citation
 Miller, MPal, AAlbusairi, WJoo, HPappas, BHaque Tuhin, MTLiang, DJampala, RLiu, FKhan, JFaaij, MPark, MChan, WGraef, IZamboni, RKumar, NFox, JSinha, UAlhamadsheh, M Enthalpy-Driven Stabilization of Transthyretin by AG10 Mimics a Naturally Occurring Genetic Variant That Protects from Transthyretin Amyloidosis. J Med Chem 61:7862-7876 (2018)  
Target
Name:
Transthyretin
Synonyms:
ATTR Prealbumin TTHY_HUMAN Transthyretin (TTR)
Type:
Enzyme
Mol. Mass.:
15884.31
Organism:
Homo sapiens (Human)
Description:
P02766
Residue:
147
  
Inhibitor
Name:
BDBM50197885
Synonyms:
CHEMBL3940890
Type:
Small organic molecule
Emp. Form.:
C15H17FN2O3
Mol. Mass.:
292.3055
SMILES:
Cc1n[nH]c(C)c1CCCOc1cc(ccc1F)C(O)=O
: