Target
Synaptic vesicular amine transporter
Ligand
BDBM50080818
Substrate
Meas. Tech.
ChEMBL_1766890 (CHEMBL4202137)
Ki
>10000±n/a nM
Citation
 Provencher, BAEshleman, AJJohnson, RAShi, XKryatova, ONelson, JTian, JGonzalez, MMeltzer, PCJanowsky, A Synthesis and Discovery of Arylpiperidinylquinazolines: New Inhibitors of the Vesicular Monoamine Transporter. J Med Chem 61:9121-9131 (2018)  
Target
Name:
Synaptic vesicular amine transporter
Synonyms:
Monoamine transporter SVMT VAT2 VMAT2_HUMAN | Vesicular amine transporter 2
Type:
PROTEIN
Mol. Mass.:
55709.61
Organism:
Homo sapiens (Human)
Description:
ChEMBL_610810
Residue:
514
  
Inhibitor
Name:
BDBM50080818
Synonyms:
(-)-lobeline 2-(6-(beta-Hydroxyphenethyl)-1-methyl-2-piperidyl)acetophenone 8,10-Diphenyllobelionol Lobelin alpha-Lobeline
Type:
Small organic molecule
Emp. Form.:
C22H27NO2
Mol. Mass.:
337.4553
SMILES:
CN1[C@H](C[C@H](O)c2ccccc2)CCC[C@@H]1CC(=O)c1ccccc1
: