Target
Neuronal acetylcholine receptor subunit alpha-3/beta-4
Ligand
BDBM50459652
Substrate
Meas. Tech.
ChEMBL_1766928 (CHEMBL4202175)
IC50
6.9±n/a nM
Citation
 Yu, JZhu, XHarvey, PJKaas, QZhangsun, DCraik, DJLuo, S Single Amino Acid Substitution in ?-Conotoxin TxID Reveals a Specific ?3?4 Nicotinic Acetylcholine Receptor Antagonist. J Med Chem 61:9256-9265 (2018)  
Target
Name:
Neuronal acetylcholine receptor subunit alpha-3/beta-4
Synonyms:
Neuronal acetylcholine receptor Alpha-3/Beta-4 Neuronal acetylcholine receptor; alpha3/beta4 | nAChR subtypes alpha3 beta4
Type:
Protein
Mol. Mass.:
Description:
Components:
This complex has 2 components.
Component 1
Name:
Neuronal acetylcholine receptor subunit alpha-3
Synonyms:
ACHA3_RAT Chrna3
Type:
Enzyme
Mol. Mass.:
56995.52
Organism:
Rattus norvegicus (Rat)
Description:
P04757
Residue:
499
  
Component 2
Name:
Neuronal acetylcholine receptor subunit beta-4
Synonyms:
ACHB4_RAT Chrnb4 Neuronal acetylcholine receptor non-alpha-2 chain | Neuronal acetylcholine receptor protein beta-4 subunit
Type:
Enzyme
Mol. Mass.:
55863.89
Organism:
Rattus norvegicus (Rat)
Description:
P12392
Residue:
495
  
Inhibitor
Name:
BDBM50459652
Synonyms:
CHEMBL4215824
Type:
Small organic molecule
Emp. Form.:
C61H99N19O17S5
Mol. Mass.:
1530.881
SMILES:
CC[C@H](C)[C@@H]1NC(=O)[C@@H]2CCCN2C(=O)[C@H](CO)NC(=O)[C@H](CCSC)NC(=O)[C@H](C)NC(=O)[C@H](CCCCN)NC(=O)[C@@H]2CSSC[C@H](NC(=O)CN)C(=O)N[C@@H](CSSC[C@H](NC1=O)C(N)=O)C(=O)N[C@@H](CO)C(=O)N[C@@H](Cc1cnc[nH]1)C(=O)N1CCC[C@H]1C(=O)N[C@@H](C(C)C)C(=O)N2
: