Target
Protein AF-9
Ligand
BDBM50459725
Substrate
Meas. Tech.
ChEMBL_1767019 (CHEMBL4202266)
Ki
4250±n/a nM
Citation
 Du, LGrigsby, SMYao, AChang, YJohnson, GSun, HNikolovska-Coleska, Z Peptidomimetics for Targeting Protein-Protein Interactions between DOT1L and MLL Oncofusion Proteins AF9 and ENL. ACS Med Chem Lett 9:895-900 (2018)  
Target
Name:
Protein AF-9
Synonyms:
AF9 ALL1-fused gene from chromosome 9 protein Myeloid/lymphoid or mixed-lineage leukemia translocated to chromosome 3 protein YEATS domain-containing protein 3 | YEATS3
Type:
PROTEIN
Mol. Mass.:
63368.78
Organism:
Homo sapiens
Description:
ChEMBL_118006
Residue:
568
  
Inhibitor
Name:
BDBM50459725
Synonyms:
CHEMBL4204221
Type:
Small organic molecule
Emp. Form.:
C43H77N9O8
Mol. Mass.:
848.127
SMILES:
CC[C@H](C)[C@H](NC(=O)[C@@H]1CCCN1C(=O)[C@H](CC(C)C)NC(C)=O)C(=O)N[C@@H](CCCN)C(=O)N[C@@H]([C@@H](C)CC)C(=O)N1CCC[C@H]1C(=O)N[C@@H](CC(C)C)C(=O)N(C)C
: