Target
5-hydroxytryptamine receptor 2A
Ligand
BDBM50095027
Substrate
Meas. Tech.
ChEMBL_1770516 (CHEMBL4222628)
IC50
4.8±n/a nM
Citation
 Gilbertson, SRChen, YCSoto, CAYang, YRice, KCCunningham, KAAnastasio, NC Synthesis and activity of functionalizable derivatives of the serotonin (5-HT) 5-HT Bioorg Med Chem Lett 28:1381-1385 (2018)  
Target
Name:
5-hydroxytryptamine receptor 2A
Synonyms:
5-HT-2 5-HT2A 5-hydroxytryptamine receptor 2A (5HT-2A) 5HT2A_HUMAN HTR2A | Serotonin receptor 2A
Type:
undefined
Mol. Mass.:
52607.65
Organism:
Homo sapiens (Human)
Description:
P28223
Residue:
471
  
Inhibitor
Name:
BDBM50095027
Synonyms:
(2,3-Dimethoxy-phenyl)-{1-[2-(4-fluoro-phenyl)-ethyl]-piperidin-4-yl}-methanol (2,3-Dimethoxy-phenyl)-{1-[2-(4-fluoro-phenyl)-ethyl]-piperidin-4-yl}-methanol(MDL 100907) (R)-(2,3-Dimethoxy-phenyl)-{1-[2-(4-fluoro-phenyl)-ethyl]-piperidin-4-yl}-methanol (R)-(2,3-dimethoxyphenyl)(1-(4-fluorophenethyl)piperidin-4-yl)methanol MDL 100907 | MDL-100907
Type:
Small organic molecule
Emp. Form.:
C22H28FNO3
Mol. Mass.:
373.461
SMILES:
COc1cccc([C@H](O)C2CCN(CCc3ccc(F)cc3)CC2)c1OC
: