Target
G protein-coupled receptor kinase 5
Ligand
BDBM284001
Substrate
Meas. Tech.
ChEMBL_1771207 (CHEMBL4223319)
IC50
2800±n/a nM
Citation
 Waldschmidt, HVBouley, RKirchhoff, PDLee, PTesmer, JJGLarsen, SD Utilizing a structure-based docking approach to develop potent G protein-coupled receptor kinase (GRK) 2 and 5 inhibitors. Bioorg Med Chem Lett 28:1507-1515 (2018)  
Target
Name:
G protein-coupled receptor kinase 5
Synonyms:
G protein-coupled receptor kinase GRK5 GRK5 | GRK5_HUMAN
Type:
PROTEIN
Mol. Mass.:
67798.93
Organism:
Homo sapiens (Human)
Description:
ChEMBL_1280627
Residue:
590
  
Inhibitor
Name:
BDBM284001
Synonyms:
E27 | US10023564, Example 27
Type:
Small organic molecule
Emp. Form.:
C29H27FN6O4
Mol. Mass.:
542.5609
SMILES:
COc1ccccc1C(C)NC(=O)c1cc(ccc1F)C1NC(=O)NC(C)=C1C(=O)Nc1ccc2[nH]ncc2c1
: