Target
Serine palmitoyltransferase 2
Ligand
BDBM50461641
Substrate
Meas. Tech.
ChEMBL_1771688 (CHEMBL4223800)
IC50
5.1±n/a nM
Citation
 Kojima, TAsano, YKurasawa, OHirata, YIwamura, NWong, TTSaito, BTanaka, YArai, RYonemori, KMiyamoto, YSagiya, YYaguchi, MShibata, SMizutani, ASano, OAdachi, RSatomi, YHirayama, MAoyama, KHiura, YKiba, AKitamura, SImamura, S Discovery of novel serine palmitoyltransferase inhibitors as cancer therapeutic agents. Bioorg Med Chem 26:2452-2465 (2018)  
Target
Name:
Serine palmitoyltransferase 2
Synonyms:
KIAA0526 LCB2 Long chain base biosynthesis protein 2 SPT 2 SPTLC2 | Serine-palmitoyl-CoA transferase 2
Type:
PROTEIN
Mol. Mass.:
62932.15
Organism:
Homo sapiens (Human)
Description:
ChEMBL_660504
Residue:
562
  
Inhibitor
Name:
BDBM50461641
Synonyms:
CHEMBL4225192
Type:
Small organic molecule
Emp. Form.:
C25H22Cl2N2O4
Mol. Mass.:
485.359
SMILES:
COc1ccc(cc1OC)C(=O)N1CCC(NC(=O)c2ccccc2Cl)c2ccc(Cl)cc12
: