Target
Serine palmitoyltransferase 2
Ligand
BDBM50461642
Substrate
Meas. Tech.
ChEMBL_1771688 (CHEMBL4223800)
IC50
2800±n/a nM
Citation
 Kojima, TAsano, YKurasawa, OHirata, YIwamura, NWong, TTSaito, BTanaka, YArai, RYonemori, KMiyamoto, YSagiya, YYaguchi, MShibata, SMizutani, ASano, OAdachi, RSatomi, YHirayama, MAoyama, KHiura, YKiba, AKitamura, SImamura, S Discovery of novel serine palmitoyltransferase inhibitors as cancer therapeutic agents. Bioorg Med Chem 26:2452-2465 (2018)  
Target
Name:
Serine palmitoyltransferase 2
Synonyms:
KIAA0526 LCB2 Long chain base biosynthesis protein 2 SPT 2 SPTLC2 | Serine-palmitoyl-CoA transferase 2
Type:
PROTEIN
Mol. Mass.:
62932.15
Organism:
Homo sapiens (Human)
Description:
ChEMBL_660504
Residue:
562
  
Inhibitor
Name:
BDBM50461642
Synonyms:
CHEMBL4229268
Type:
Small organic molecule
Emp. Form.:
C25H26F3N5O5
Mol. Mass.:
533.4996
SMILES:
COc1cc(cnc1OC)C(=O)N1CC[C@@H](NC(=O)c2ccccc2OC(F)(F)F)c2c1cnn2C(C)C
: