Target
Serine palmitoyltransferase 2
Ligand
BDBM50461645
Substrate
Meas. Tech.
ChEMBL_1771688 (CHEMBL4223800)
IC50
0.710000±n/a nM
Citation
 Kojima, TAsano, YKurasawa, OHirata, YIwamura, NWong, TTSaito, BTanaka, YArai, RYonemori, KMiyamoto, YSagiya, YYaguchi, MShibata, SMizutani, ASano, OAdachi, RSatomi, YHirayama, MAoyama, KHiura, YKiba, AKitamura, SImamura, S Discovery of novel serine palmitoyltransferase inhibitors as cancer therapeutic agents. Bioorg Med Chem 26:2452-2465 (2018)  
Target
Name:
Serine palmitoyltransferase 2
Synonyms:
KIAA0526 LCB2 Long chain base biosynthesis protein 2 SPT 2 SPTLC2 | Serine-palmitoyl-CoA transferase 2
Type:
PROTEIN
Mol. Mass.:
62932.15
Organism:
Homo sapiens (Human)
Description:
ChEMBL_660504
Residue:
562
  
Inhibitor
Name:
BDBM50461645
Synonyms:
CHEMBL4228472
Type:
Small organic molecule
Emp. Form.:
C26H22ClF3N6O2
Mol. Mass.:
542.94
SMILES:
Cn1nc(cc1C(=O)N[C@@H]1CCN(C[C@@H]1c1ccccc1)C(=O)c1cc(Cl)c2nccnc2c1)C(F)(F)F
: