Target
Signal transducer and activator of transcription 3
Ligand
BDBM50462012
Substrate
Meas. Tech.
ChEMBL_1772375 (CHEMBL4224487)
IC50
10000±n/a nM
Citation
 Kim, YHYoon, YJLee, YJKim, CHLee, SChoung, DHHan, DCKwon, BM Piperlongumine derivative, CG-06, inhibits STAT3 activity by direct binding to STAT3 and regulating the reactive oxygen species in DU145 prostate carcinoma cells. Bioorg Med Chem Lett 28:2566-2572 (2018)  
Target
Name:
Signal transducer and activator of transcription 3
Synonyms:
APRF STAT3_HUMAN Signal transducer and activator of transcription 3 (STAT3)
Type:
Protein
Mol. Mass.:
88064.31
Organism:
Homo sapiens (Human)
Description:
P40763
Residue:
770
  
Inhibitor
Name:
BDBM50462012
Synonyms:
CHEMBL4227152
Type:
Small organic molecule
Emp. Form.:
C23H24BrNO5
Mol. Mass.:
474.344
SMILES:
COc1cc(\C=C\C(=O)N(Cc2ccc(Br)cc2)C(=O)C(C)=C)cc(OC)c1OC
: