Target
Mitogen-activated protein kinase 13
Ligand
BDBM50463479
Substrate
Meas. Tech.
ChEMBL_1778406 (CHEMBL4235398)
Ki
>2000±n/a nM
Citation
 Bandarage, UKCao, JCome, JHCourt, JJGao, HJacobs, MDMarhefka, CNanthakumar, SGreen, J ROCK inhibitors 3: Design, synthesis and structure-activity relationships of 7-azaindole-based Rho kinase (ROCK) inhibitors. Bioorg Med Chem Lett 28:2622-2626 (2018)  
Target
Name:
Mitogen-activated protein kinase 13
Synonyms:
MAP kinase p38 delta MK13_HUMAN Mitogen-activated protein kinase 13 (MAPK13) Mitogen-activated protein kinase p38 delta SAPK4 p38 delta/gamma
Type:
Enzyme
Mol. Mass.:
42097.16
Organism:
Homo sapiens (Human)
Description:
O15264
Residue:
365
  
Inhibitor
Name:
BDBM50463479
Synonyms:
CHEMBL4249925
Type:
Small organic molecule
Emp. Form.:
C19H17N5O3S2
Mol. Mass.:
427.5
SMILES:
CS(=O)(=O)Nc1cccc(CC(=O)Nc2nc(cs2)-c2c[nH]c3ncccc23)c1
: