Target
Lysyl oxidase homolog 3
Ligand
BDBM50463616
Substrate
Meas. Tech.
ChEMBL_1778829 (CHEMBL4235821)
IC50
>100000±n/a nM
Citation
 Hajdú, IKardos, JMajor, BFabó, GL?rincz, ZCseh, SDormán, G Inhibition of the LOX enzyme family members with old and new ligands. Selectivity analysis revisited. Bioorg Med Chem Lett 28:3113-3118 (2018)  
Target
Name:
Lysyl oxidase homolog 3
Synonyms:
1.4.3.- LOXL LOXL3_HUMAN Lysyl oxidase-like protein 3 | Synonyms=LOXL
Type:
PROTEIN
Mol. Mass.:
83173.13
Organism:
Homo sapiens (Human)
Description:
ChEMBL_117594
Residue:
753
  
Inhibitor
Name:
BDBM50463616
Synonyms:
CHEMBL4241417
Type:
Small organic molecule
Emp. Form.:
C13H16N2O
Mol. Mass.:
216.2789
SMILES:
CC(C)(C)C1=NN(C(=O)C1)c1ccccc1
: