Target
NAD-dependent protein deacetylase sirtuin-2
Ligand
BDBM50105327
Substrate
Meas. Tech.
ChEMBL_1779303 (CHEMBL4236295)
Ki
>10000±n/a nM
Citation
 Fournier, JFBhurruth-Alcor, YMusicki, BAubert, JAurelly, MBouix-Peter, CBouquet, KChantalat, LDelorme, MDrean, BDuvert, GFleury-Bregeot, NGauthier, BGrisendi, KHarris, CSHennequin, LFIsabet, TJoly, FLafitte, GMillois, CMorgentin, RPascau, JPiwnica, DRival, YSoulet, CThoreau, ÉTomas, L Squaramides as novel class I and IIB histone deacetylase inhibitors for topical treatment of cutaneous t-cell lymphoma. Bioorg Med Chem Lett 28:2985-2992 (2018)  
Target
Name:
NAD-dependent protein deacetylase sirtuin-2
Synonyms:
NAD-Dependent Deacetylase Sirtuin-2 NAD-dependent deacetylase sirtuin 3 SIR2-like SIR2L SIR2_HUMAN Sirtuin 2 (SIRT2)
Type:
Hydrolase
Mol. Mass.:
43172.62
Organism:
Homo sapiens (Human)
Description:
Residue:
389
  
Inhibitor
Name:
BDBM50105327
Synonyms:
JNJ-26481585 | Quisinostat
Type:
Small organic molecule
Emp. Form.:
C21H26N6O2
Mol. Mass.:
394.4701
SMILES:
Cn1cc(CNCC2CCN(CC2)c2ncc(cn2)C(=O)NO)c2ccccc12
: