Target
Proteasome subunit beta type-9
Ligand
BDBM50464973
Substrate
Meas. Tech.
ChEMBL_1783551 (CHEMBL4255068)
IC50
16100±n/a nM
Citation
 Richy, NSarraf, DMaréchal, XJanmamode, NLe Guével, RGenin, EReboud-Ravaux, MVidal, J Structure-based design of human immuno- and constitutive proteasomes inhibitors. Eur J Med Chem 145:570-587 (2018)  
Target
Name:
Proteasome subunit beta type-9
Synonyms:
LMP2 Macropain chain 7 PSB9_HUMAN PSMB9 Proteasome subunit beta-1i Really interesting new gene 12 protein
Type:
PROTEIN
Mol. Mass.:
23256.49
Organism:
Homo sapiens (Human)
Description:
ChEMBL_106197
Residue:
219
  
Inhibitor
Name:
BDBM50464973
Synonyms:
CHEMBL4280071
Type:
Small organic molecule
Emp. Form.:
C43H48N6O9
Mol. Mass.:
792.876
SMILES:
CC(C)(C)OC(=O)N[C@@H](Cc1ccc(OCc2ccccc2)cc1)C(=O)N[C@@H](CC(N)=O)C(=O)N[C@@H](C[C@]1(O)C(=O)Nc2ccccc12)C(=O)NCc1ccccc1
: