Target
Muscarinic acetylcholine receptor M3
Ligand
BDBM50024996
Substrate
Meas. Tech.
ChEBML_138367
EC50
800±n/a nM
Citation
 Sauerberg, PLarsen, JJFalch, EKrogsgaard-Larsen, P A novel class of conformationally restricted heterocyclic muscarinic agonists. J Med Chem 29:1004-9 (1986)  
Target
Name:
Muscarinic acetylcholine receptor M3
Synonyms:
ACM3_HUMAN Cholinergic, muscarinic M3 Muscarinic receptor M3 | RecName: Full=Muscarinic acetylcholine receptor M3
Type:
Enzyme
Mol. Mass.:
66151.03
Organism:
Homo sapiens (Human)
Description:
P20309
Residue:
590
  
Inhibitor
Name:
BDBM50024996
Synonyms:
3-Methoxy-5-methyl-4,5,6,7-tetrahydro-isoxazolo[4,5-c]pyridin-5-ium; chloride | CHEMBL440085
Type:
Small organic molecule
Emp. Form.:
C8H13N2O2
Mol. Mass.:
169.2005
SMILES:
COc1noc2CC[NH+](C)Cc12
: