Target
Fibroblast growth factor receptor 4
Ligand
BDBM209275
Substrate
Meas. Tech.
ChEMBL_1784238 (CHEMBL4255755)
IC50
0.700000±n/a nM
Citation
 Knoepfel, TFuret, PMah, RBuschmann, NLeblanc, CRipoche, SGraus-Porta, DWartmann, MGaluba, IFairhurst, RA 2-Formylpyridyl Ureas as Highly Selective Reversible-Covalent Inhibitors of Fibroblast Growth Factor Receptor 4. ACS Med Chem Lett 9:215-220 (2018)  
Target
Name:
Fibroblast growth factor receptor 4
Synonyms:
CD_antigen: CD334 FGFR4 FGFR4 Fibroblast growth factor receptor JK2 TKF
Type:
Protein
Mol. Mass.:
87957.45
Organism:
Homo sapiens (Human)
Description:
P22455
Residue:
802
  
Inhibitor
Name:
BDBM209275
Synonyms:
US9266883, 33
Type:
Small organic molecule
Emp. Form.:
C19H19N5O3
Mol. Mass.:
365.3859
SMILES:
CC(C)Oc1cc(NC(=O)N2CCCc3ccc(C=O)nc23)ncc1C#N
: