Target
Proto-oncogene tyrosine-protein kinase ROS
Ligand
BDBM50018830
Substrate
Meas. Tech.
ChEMBL_1794128 (CHEMBL4266245)
Ki
0.100000±n/a nM
Citation
 Basit, SAshraf, ZLee, KLatif, M First macrocyclic 3 Eur J Med Chem 134:348-356 (2017)  
Target
Name:
Proto-oncogene tyrosine-protein kinase ROS
Synonyms:
MCF3 Proto-oncogene c-Ros-1 ROS1 Receptor tyrosine kinase c-ros oncogene 1 c-Ros receptor tyrosine kinase
Type:
Enzyme
Mol. Mass.:
263897.39
Organism:
Homo sapiens (Human)
Description:
P08922
Residue:
2347
  
Inhibitor
Name:
BDBM50018830
Synonyms:
CHEMBL3286830 US10780082, Compound PF-06463922 | US11517561, Compound PF-06463922
Type:
Small organic molecule
Emp. Form.:
C21H19FN6O2
Mol. Mass.:
406.413
SMILES:
C[C@H]1Oc2cc(cnc2N)-c2c(CN(C)C(=O)c3ccc(F)cc13)nn(C)c2C#N
: