Target
Structural capsid protein
Ligand
BDBM50467392
Substrate
Meas. Tech.
ChEMBL_1795990 (CHEMBL4268107)
Kd
17300±n/a nM
Citation
 Wu, GZalloum, WAMeuser, MEJing, LKang, DChen, CHTian, YZhang, FCocklin, SLee, KHLiu, XZhan, P Discovery of phenylalanine derivatives as potent HIV-1 capsid inhibitors from click chemistry-based compound library. Eur J Med Chem 158:478-492 (2018)  
Target
Name:
Structural capsid protein
Synonyms:
Structural capsid protein | gag
Type:
PROTEIN
Mol. Mass.:
12762.23
Organism:
Human immunodeficiency virus 1
Description:
ChEMBL_106648
Residue:
115
  
Inhibitor
Name:
BDBM50467392
Synonyms:
CHEMBL4287882
Type:
Small organic molecule
Emp. Form.:
C27H27N5O3S
Mol. Mass.:
501.6
SMILES:
COc1ccc(cc1)N(C)C(=O)[C@H](Cc1ccccc1)NC(=O)c1cn(CSc2ccccc2)nn1
: