Target
Structural capsid protein
Ligand
BDBM50467394
Substrate
Meas. Tech.
ChEMBL_1795989 (CHEMBL4268106)
Kd
28200±n/a nM
Citation
 Wu, GZalloum, WAMeuser, MEJing, LKang, DChen, CHTian, YZhang, FCocklin, SLee, KHLiu, XZhan, P Discovery of phenylalanine derivatives as potent HIV-1 capsid inhibitors from click chemistry-based compound library. Eur J Med Chem 158:478-492 (2018)  
Target
Name:
Structural capsid protein
Synonyms:
Structural capsid protein | gag
Type:
PROTEIN
Mol. Mass.:
12762.23
Organism:
Human immunodeficiency virus 1
Description:
ChEMBL_106648
Residue:
115
  
Inhibitor
Name:
BDBM50467394
Synonyms:
CHEMBL4279975
Type:
Small organic molecule
Emp. Form.:
C27H27N5O4S
Mol. Mass.:
517.599
SMILES:
COc1ccc(cc1)N(C)C(=O)[C@H](Cc1ccccc1)NC(=O)c1cn(C[S+]([O-])c2ccccc2)nn1
: