Target
Structural capsid protein
Ligand
BDBM50467395
Substrate
Meas. Tech.
ChEMBL_1795991 (CHEMBL4268108)
Kd
64±n/a nM
Citation
 Wu, GZalloum, WAMeuser, MEJing, LKang, DChen, CHTian, YZhang, FCocklin, SLee, KHLiu, XZhan, P Discovery of phenylalanine derivatives as potent HIV-1 capsid inhibitors from click chemistry-based compound library. Eur J Med Chem 158:478-492 (2018)  
Target
Name:
Structural capsid protein
Synonyms:
Structural capsid protein | gag
Type:
PROTEIN
Mol. Mass.:
12762.23
Organism:
Human immunodeficiency virus 1
Description:
ChEMBL_106648
Residue:
115
  
Inhibitor
Name:
BDBM50467395
Synonyms:
CHEMBL1229713
Type:
Small organic molecule
Emp. Form.:
C27H27N3O2
Mol. Mass.:
425.5222
SMILES:
CN(C(=O)[C@H](Cc1ccccc1)NC(=O)Cc1c(C)[nH]c2ccccc12)c1ccccc1
: