Target
Mitogen-activated protein kinase 14
Ligand
BDBM50364378
Substrate
Meas. Tech.
ChEMBL_1800097 (CHEMBL4272389)
IC50
3400±n/a nM
Citation
 Juillerat-Jeanneret, LAubert, JDMikulic, JGolshayan, D Fibrogenic Disorders in Human Diseases: From Inflammation to Organ Dysfunction. J Med Chem 61:9811-9840 (2018)  
Target
Name:
Mitogen-activated protein kinase 14
Synonyms:
CSAID-binding protein CSBP1 CSPB1 MAP kinase 14 MAP kinase p38 alpha MAPK14 MK14_HUMAN Mitogen-activated protein kinase p38 alpha Stress-activated protein kinase 2a | p38 MAP kinase alpha/beta
Type:
Serine/threonine-protein kinase
Mol. Mass.:
41286.76
Organism:
Homo sapiens (Human)
Description:
Q16539
Residue:
360
  
Inhibitor
Name:
BDBM50364378
Synonyms:
CHEMBL1950289
Type:
Small organic molecule
Emp. Form.:
C21H23F3N6O2
Mol. Mass.:
448.4415
SMILES:
O[C@H]1CC[C@@H](CC1)Nc1ncc2nc(Nc3c(F)cc(F)cc3F)n([C@H]3CCOC3)c2n1
: