Target
Protein mono-ADP-ribosyltransferase PARP10
Ligand
BDBM50468581
Substrate
Meas. Tech.
ChEMBL_1800447 (CHEMBL4272739)
IC50
710±n/a nM
Citation
 Murthy, SDesantis, JVerheugd, PMaksimainen, MMVenkannagari, HMassari, SAshok, YObaji, ENkizinkinko, YLüscher, BTabarrini, OLehtiö, L 4-(Phenoxy) and 4-(benzyloxy)benzamides as potent and selective inhibitors of mono-ADP-ribosyltransferase PARP10/ARTD10. Eur J Med Chem 156:93-102 (2018)  
Target
Name:
Protein mono-ADP-ribosyltransferase PARP10
Synonyms:
2.4.2.- ADP-ribosyltransferase diphtheria toxin-like 10 Human diphtheria toxin-like ADP-ribosyltransferase (ARTD10 or PARP10, L926Y)) Human diphtheria toxin-like ADP-ribosyltransferase (ARTD10 or PARP10, S927A)) PARP-10 Poly [ADP-ribose] polymerase 10
Type:
Mol. Mass.:
109953.63
Organism:
Homo sapiens (Human)
Description:
Q53GL7
Residue:
1025
  
Inhibitor
Name:
BDBM50468581
Synonyms:
CHEMBL4287655
Type:
Small organic molecule
Emp. Form.:
C14H11NO3
Mol. Mass.:
241.242
SMILES:
NC(=O)c1ccc(Oc2ccc(C=O)cc2)cc1
: