Target
Prostaglandin E synthase
Ligand
BDBM50000541
Substrate
Meas. Tech.
ChEMBL_1801304 (CHEMBL4273596)
IC50
600±n/a nM
Citation
 Cheung, SYWerner, MEsposito, LTroisi, FCantone, VLiening, SKönig, SGerstmeier, JKoeberle, ABilancia, RRizza, RRossi, ARoviezzo, FTemml, VSchuster, DStuppner, HSchubert-Zsilavecz, MWerz, OHanke, TPace, S Discovery of a benzenesulfonamide-based dual inhibitor of microsomal prostaglandin E Eur J Med Chem 156:815-830 (2018)  
Target
Name:
Prostaglandin E synthase
Synonyms:
MGST1L1 PGES PTGES Prostaglandin E synthase (PGES-1) Prostaglandin E synthase-1 (PGES-1) Prostaglandin E2 synthase-1 ( mPGES-1)
Type:
Protein
Mol. Mass.:
17112.22
Organism:
Homo sapiens (Human)
Description:
Residue:
152
  
Inhibitor
Name:
BDBM50000541
Synonyms:
(+-)-1-(1-Benzo[b]thien-2-ylethyl)-1-hydroxyurea CHEMBL93 N-(1-Benzo(b)thien-2-ylethyl)-N-hydroxyurea ZILEUTON | Zyflo (TN)
Type:
Small organic molecule
Emp. Form.:
C11H12N2O2S
Mol. Mass.:
236.29
SMILES:
CC(N(O)C(N)=O)c1cc2ccccc2s1
: