Target
5-hydroxytryptamine receptor 1B
Ligand
BDBM50026385
Substrate
Meas. Tech.
ChEMBL_201212 (CHEMBL804008)
Ki
67±n/a nM
Citation
 Huff, JRKing, SWSaari, WSSpringer, JPMartin, GEWilliams, M Bioactive conformation of 1-arylpiperazines at central serotonin receptors. J Med Chem 28:945-8 (1985)  
Target
Name:
5-hydroxytryptamine receptor 1B
Synonyms:
5-HT-1B 5-hydroxytryptamine receptor 1B (5HT1B) 5ht1b Serotonin 1 (5-HT1) receptor Serotonin receptor 1B
Type:
Protein
Mol. Mass.:
43173.33
Organism:
Rattus norvegicus (Rat)
Description:
P28564
Residue:
386
  
Inhibitor
Name:
BDBM50026385
Synonyms:
9-Trifluoromethyl-2,3,4,4a,5,6-hexahydro-1H-pyrazino[1,2-a]quinoline | CHEMBL351530
Type:
Small organic molecule
Emp. Form.:
C13H15F3N2
Mol. Mass.:
256.2668
SMILES:
FC(F)(F)c1ccc2CCC3CNCCN3c2c1
: