Target
Peroxisome proliferator-activated receptor gamma
Ligand
BDBM50428854
Substrate
Meas. Tech.
ChEMBL_1804107 (CHEMBL4276399)
EC50
>500±n/a nM
Citation
 Yamamoto, KTamura, THenmi, KKuboyama, TYanagisawa, AMatsubara, MTakahashi, YSuzuki, MSaito, JIUeno, KShuto, S Development of Dihydrodibenzooxepine Peroxisome Proliferator-Activated Receptor (PPAR) Gamma Ligands of a Novel Binding Mode as Anticancer Agents: Effective Mimicry of Chiral Structures by Olefinic E/ Z-Isomers. J Med Chem 61:10067-10083 (2018)  
Target
Name:
Peroxisome proliferator-activated receptor gamma
Synonyms:
NR1C3 PPAR-gamma PPARG_HUMAN Peroxisome proliferator-activated receptor gamma (PPAR gamma) Peroxisome proliferator-activated receptor gamma (PPARĪ³) peroxisome proliferator-activated receptor gamma isoform 2
Type:
Nuclear Receptor
Mol. Mass.:
57613.46
Organism:
Homo sapiens (Human)
Description:
P37231
Residue:
505
  
Inhibitor
Name:
BDBM50428854
Synonyms:
CHEMBL1236924
Type:
Small organic molecule
Emp. Form.:
C21H12Cl4N2O3S
Mol. Mass.:
514.209
SMILES:
Clc1ccc(c(Cl)c1)S(=O)(=O)Nc1cc(Cl)c(Oc2cnc3ccccc3c2)c(Cl)c1
: