Target
mRNA cap guanine-N7 methyltransferase
Ligand
BDBM50470562
Substrate
Meas. Tech.
ChEMBL_1803165 (CHEMBL4275457)
Ki
>50000±n/a nM
Citation
 Tao, ZCao, RYan, YHuang, GLv, KLi, WGeng, YZhao, LWang, AHe, QYang, JFan, SHuang, MGuo, HZhong, WLiu, M Design, synthesis and in vitro anti-Zika virus evaluation of novel Sinefungin derivatives. Eur J Med Chem 157:994-1004 (2018)  
Target
Name:
mRNA cap guanine-N7 methyltransferase
Synonyms:
2.1.1.56 MCES_HUMAN RNMT hMet mRNA (guanine-N(7)-)-methyltransferase mRNA cap methyltransferase
Type:
PROTEIN
Mol. Mass.:
54843.48
Organism:
Homo sapiens
Description:
ChEMBL_117907
Residue:
476
  
Inhibitor
Name:
BDBM50470562
Synonyms:
CHEMBL1230055
Type:
Small organic molecule
Emp. Form.:
C21H25ClN6O5S
Mol. Mass.:
508.978
SMILES:
N[C@@H](CCSC[C@H]1O[C@H]([C@H](O)[C@@H]1O)n1cnc2c(NCc3cccc(Cl)c3)ncnc12)C(O)=O
: