Target
Similar to alpha-tubulin isoform 1
Ligand
BDBM50009568
Substrate
Meas. Tech.
ChEMBL_211316 (CHEMBL818976)
IC50
4900±n/a nM
Citation
 Sun, LMcPhail, ATHamel, ELin, CMHastie, SBChang, JJLee, KH Antitumor agents. 139. Synthesis and biological evaluation of thiocolchicine analogs 5,6-dihydro-6(S)-(acyloxy)- and 5,6-dihydro-6(S)-[(aroyloxy)methyl]-1,2,3-trimethoxy-9-(methylthio)-8H- cyclohepta[a]naphthalen-8-ones as novel cytotoxic and antimitotic agents. J Med Chem 36:544-51 (1993)  
Target
Name:
Similar to alpha-tubulin isoform 1
Synonyms:
Similar to alpha-tubulin isoform 1
Type:
PROTEIN
Mol. Mass.:
10383.05
Organism:
Bos taurus
Description:
ChEMBL_104716
Residue:
99
  
Inhibitor
Name:
BDBM50009568
Synonyms:
(Thiocolchicine)N-(1,2,3-Trimethoxy-10-methylsulfanyl-9-oxo-5,6,7,9-tetrahydro-benzo[a]heptalen-7-yl)-acetamide N-((S)-1,2,3-Trimethoxy-10-methylsulfanyl-9-oxo-5,6,7,9-tetrahydro-benzo[a]heptalen-7-yl)-acetamide N-(1,2,3-Trimethoxy-10-methylsulfanyl-9-oxo-5,6,7,9-tetrahydro-benzo[a]heptalen-7-yl)-acetamide (Thiocolchicine) THIOCOLCHICINE
Type:
Small organic molecule
Emp. Form.:
C22H25NO5S
Mol. Mass.:
415.503
SMILES:
COc1cc2CC[C@H](NC(C)=O)c3cc(=O)c(SC)ccc3-c2c(OC)c1OC
: