Target
Progesterone receptor
Ligand
BDBM8903
Substrate
Meas. Tech.
ChEMBL_159709 (CHEMBL764185)
Ki
10.4±n/a nM
Citation
 Hoyte, RMRosner, WJohnson, ISZielinski, JHochberg, RB Synthesis and evaluation of potential radioligands for the progesterone receptor. J Med Chem 28:1695-9 (1985)  
Target
Name:
Progesterone receptor
Synonyms:
NR3C3 PRGR_RABIT
Type:
PROTEIN
Mol. Mass.:
98665.51
Organism:
Oryctolagus cuniculus
Description:
ChEMBL_775980
Residue:
930
  
Inhibitor
Name:
BDBM8903
Synonyms:
(1S,2R,10S,11S,14S,15S)-14-acetyl-2,15-dimethyltetracyclo[8.7.0.0^{2,7}.0^{11,15}]heptadec-6-en-5-one progesterone
Type:
Steroid
Emp. Form.:
C21H30O2
Mol. Mass.:
314.4617
SMILES:
[H][C@@]12CC[C@H](C(C)=O)[C@@]1(C)CC[C@@]1([H])[C@@]2([H])CCC2=CC(=O)CC[C@]12C
: