Target
Histamine H1 receptor
Ligand
BDBM50470714
Substrate
Meas. Tech.
ChEMBL_84111 (CHEMBL699475)
EC50
9990±n/a nM
Citation
 Leschke, CElz, SGarbarg, MSchunack, W Synthesis and histamine H1 receptor agonist activity of a series of 2-phenylhistamines, 2-heteroarylhistamines, and analogues. J Med Chem 38:1287-94 (1995)  
Target
Name:
Histamine H1 receptor
Synonyms:
HISTAMINE H1 HRH1_CAVPO
Type:
G Protein-Coupled Receptor (GPCR)
Mol. Mass.:
55641.53
Organism:
Cavia porcellus (domestic guinea pig)
Description:
Guinea pig cerebellum was used in binding assay.
Residue:
488
  
Inhibitor
Name:
BDBM50470714
Synonyms:
CHEMBL26064
Type:
Small organic molecule
Emp. Form.:
C9H11N3S
Mol. Mass.:
193.269
SMILES:
NCCc1c[nH]c(n1)-c1cccs1
: