Target
Histamine H1 receptor
Ligand
BDBM22866
Substrate
Meas. Tech.
ChEMBL_84111 (CHEMBL699475)
EC50
6760±n/a nM
Citation
 Leschke, CElz, SGarbarg, MSchunack, W Synthesis and histamine H1 receptor agonist activity of a series of 2-phenylhistamines, 2-heteroarylhistamines, and analogues. J Med Chem 38:1287-94 (1995)  
Target
Name:
Histamine H1 receptor
Synonyms:
HISTAMINE H1 HRH1_CAVPO
Type:
G Protein-Coupled Receptor (GPCR)
Mol. Mass.:
55641.53
Organism:
Cavia porcellus (domestic guinea pig)
Description:
Guinea pig cerebellum was used in binding assay.
Residue:
488
  
Inhibitor
Name:
BDBM22866
Synonyms:
2-(1,3-thiazol-2-yl)ethan-1-amine 2-(2-aminoethyl)thiazole TEA
Type:
Small organic molecule
Emp. Form.:
C5H8N2S
Mol. Mass.:
128.195
SMILES:
NCCc1nccs1
: