Target
Sodium/hydrogen exchanger 3
Ligand
BDBM50471144
Substrate
Meas. Tech.
ChEMBL_164985 (CHEMBL774080)
IC50
5.9±n/a nM
Citation
 Baumgarth, MBeier, NGericke, R (2-Methyl-5-(methylsulfonyl)benzoyl)guanidine Na+/H+ antiporter inhibitors. J Med Chem 40:2017-34 (1997)  
Target
Name:
Sodium/hydrogen exchanger 3
Synonyms:
NHE-3 Na(+)/H(+) exchanger 3 SLC9A3 Solute carrier family 9 member 3
Type:
PROTEIN
Mol. Mass.:
92760.60
Organism:
Oryctolagus cuniculus
Description:
ChEMBL_104865
Residue:
832
  
Inhibitor
Name:
BDBM50471144
Synonyms:
CHEMBL60551
Type:
Small organic molecule
Emp. Form.:
C12H17N3O3S2
Mol. Mass.:
315.412
SMILES:
[#6]-[#6]-[#16]-c1cc(-[#6])c(cc1S([#6])(=O)=O)-[#6](=O)\[#7]=[#6](/[#7])-[#7]
: