Target
Sodium/hydrogen exchanger 3
Ligand
BDBM50471217
Substrate
Meas. Tech.
ChEMBL_164985 (CHEMBL774080)
IC50
25±n/a nM
Citation
 Baumgarth, MBeier, NGericke, R (2-Methyl-5-(methylsulfonyl)benzoyl)guanidine Na+/H+ antiporter inhibitors. J Med Chem 40:2017-34 (1997)  
Target
Name:
Sodium/hydrogen exchanger 3
Synonyms:
NHE-3 Na(+)/H(+) exchanger 3 SLC9A3 Solute carrier family 9 member 3
Type:
PROTEIN
Mol. Mass.:
92760.60
Organism:
Oryctolagus cuniculus
Description:
ChEMBL_104865
Residue:
832
  
Inhibitor
Name:
BDBM50471217
Synonyms:
CHEMBL60785
Type:
Small organic molecule
Emp. Form.:
C13H15N5O3S
Mol. Mass.:
321.355
SMILES:
[#6]-c1cc(c(cc1-[#6](=O)\[#7]=[#6](/[#7])-[#7])S([#6])(=O)=O)-n1cccn1
: