Target
Muscarinic acetylcholine receptor M1/M2/M3/M4/M5
Ligand
BDBM50033151
Substrate
Meas. Tech.
ChEMBL_139460 (CHEMBL752168)
Ki
4.0±n/a nM
Citation
 Mitch, CHBrown, TJBymaster, FPCalligaro, DODieckman, DMerrit, LPeters, SCQuimby, SJShannon, HEShipley, LAWard, JSHansen, KOlesen, PHSauerberg, PSheardown, MJSwedberg, MDSuzdak, PGreenwood, B Muscarinic analgesics with potent and selective effects on the gastrointestinal tract: potential application for the treatment of irritable bowel syndrome. J Med Chem 40:538-46 (1997)  
Target
Name:
Muscarinic acetylcholine receptor M1/M2/M3/M4/M5
Synonyms:
Muscarinic acetylcholine receptor
Type:
Mol. Mass.:
Description:
ASSAY_ID of ChEMBL is 1821274
Components:
This complex has 5 components.
Component 1
Name:
Muscarinic acetylcholine receptor M1
Synonyms:
ACM1_RAT Chrm-1 cholinergic receptor, muscarinic 1
Type:
Enzyme Catalytic Domain
Mol. Mass.:
51390.46
Organism:
RAT
Description:
P08482
Residue:
460
  
Component 2
Name:
Muscarinic acetylcholine receptor M3
Synonyms:
ACM3_RAT Chrm-3 | Chrm3
Type:
Enzyme Catalytic Domain
Mol. Mass.:
66086.66
Organism:
RAT
Description:
Cholinergic, muscarinic M3 CHRM3 RAT::P08483
Residue:
589
  
Component 3
Name:
Muscarinic acetylcholine receptor M4
Synonyms:
ACM4_RAT Chrm-4 | Chrm4
Type:
Enzyme Catalytic Domain
Mol. Mass.:
52841.70
Organism:
RAT
Description:
Cholinergic, muscarinic M4 CHRM4 RAT::P08485
Residue:
477
  
Component 4
Name:
Muscarinic acetylcholine receptor M5
Synonyms:
ACM5_RAT Chrm-5 Muscarinic acetylcholine receptor | Muscarinic acetylcholine receptor M5
Type:
Enzyme Catalytic Domain
Mol. Mass.:
60161.80
Organism:
RAT
Description:
Cholinergic, muscarinic M5 CHRM5 RAT::P08911
Residue:
531
  
Component 5
Name:
Muscarinic acetylcholine receptor M2
Synonyms:
ACM2_RAT Chrm-2 | Chrm2
Type:
Enzyme Catalytic Domain
Mol. Mass.:
51555.53
Organism:
RAT
Description:
P10980
Residue:
466
  
Inhibitor
Name:
BDBM50033151
Synonyms:
3-(3-Hexylsulfanyl-pyrazin-2-yl)-1-aza-bicyclo[2.2.2]octane | CHEMBL332700
Type:
Small organic molecule
Emp. Form.:
C17H27N3S
Mol. Mass.:
305.481
SMILES:
CCCCCCSc1nccnc1C1CN2CCC1CC2
: