Target
Peroxisome proliferator-activated receptor gamma
Ligand
BDBM50471967
Substrate
Meas. Tech.
ChEMBL_154524 (CHEMBL762151)
Ki
4.8±n/a nM
Citation
 Collins, JLBlanchard, SGBoswell, GECharifson, PSCobb, JEHenke, BRHull-Ryde, EAKazmierski, WMLake, DHLeesnitzer, LMLehmann, JLenhard, JMOrband-Miller, LAGray-Nunez, YParks, DJPlunkett, KDTong, WQ N-(2-Benzoylphenyl)-L-tyrosine PPARgamma agonists. 2. Structure-activity relationship and optimization of the phenyl alkyl ether moiety. J Med Chem 41:5037-54 (1998)  
Target
Name:
Peroxisome proliferator-activated receptor gamma
Synonyms:
NR1C3 PPAR-gamma PPARG_HUMAN Peroxisome proliferator-activated receptor gamma (PPAR gamma) Peroxisome proliferator-activated receptor gamma (PPARĪ³) peroxisome proliferator-activated receptor gamma isoform 2
Type:
Nuclear Receptor
Mol. Mass.:
57613.46
Organism:
Homo sapiens (Human)
Description:
P37231
Residue:
505
  
Inhibitor
Name:
BDBM50471967
Synonyms:
CHEMBL342292
Type:
Small organic molecule
Emp. Form.:
C33H30N4O4
Mol. Mass.:
546.6157
SMILES:
Cc1nc(nn1CCOc1ccc(C[C@H](Nc2ccccc2C(=O)c2ccccc2)C(O)=O)cc1)-c1ccccc1
: