Target
Peroxisome proliferator-activated receptor gamma
Ligand
BDBM50471974
Substrate
Meas. Tech.
ChEMBL_154524 (CHEMBL762151)
Ki
1.4±n/a nM
Citation
 Collins, JLBlanchard, SGBoswell, GECharifson, PSCobb, JEHenke, BRHull-Ryde, EAKazmierski, WMLake, DHLeesnitzer, LMLehmann, JLenhard, JMOrband-Miller, LAGray-Nunez, YParks, DJPlunkett, KDTong, WQ N-(2-Benzoylphenyl)-L-tyrosine PPARgamma agonists. 2. Structure-activity relationship and optimization of the phenyl alkyl ether moiety. J Med Chem 41:5037-54 (1998)  
Target
Name:
Peroxisome proliferator-activated receptor gamma
Synonyms:
NR1C3 PPAR-gamma PPARG_HUMAN Peroxisome proliferator-activated receptor gamma (PPAR gamma) Peroxisome proliferator-activated receptor gamma (PPARĪ³) peroxisome proliferator-activated receptor gamma isoform 2
Type:
Nuclear Receptor
Mol. Mass.:
57613.46
Organism:
Homo sapiens (Human)
Description:
P37231
Residue:
505
  
Inhibitor
Name:
BDBM50471974
Synonyms:
CHEMBL148950
Type:
Small organic molecule
Emp. Form.:
C33H29N3O5
Mol. Mass.:
547.6005
SMILES:
Cc1oc(nc1CCOc1ccc(C[C@H](Nc2ccccc2C(=O)c2ccccc2)C(O)=O)cc1)-c1ccncc1
: