Target
Peroxisome proliferator-activated receptor gamma
Ligand
BDBM50471948
Substrate
Meas. Tech.
ChEMBL_154524 (CHEMBL762151)
Ki
2.0±n/a nM
Citation
 Collins, JLBlanchard, SGBoswell, GECharifson, PSCobb, JEHenke, BRHull-Ryde, EAKazmierski, WMLake, DHLeesnitzer, LMLehmann, JLenhard, JMOrband-Miller, LAGray-Nunez, YParks, DJPlunkett, KDTong, WQ N-(2-Benzoylphenyl)-L-tyrosine PPARgamma agonists. 2. Structure-activity relationship and optimization of the phenyl alkyl ether moiety. J Med Chem 41:5037-54 (1998)  
Target
Name:
Peroxisome proliferator-activated receptor gamma
Synonyms:
NR1C3 PPAR-gamma PPARG_HUMAN Peroxisome proliferator-activated receptor gamma (PPAR gamma) Peroxisome proliferator-activated receptor gamma (PPARĪ³) peroxisome proliferator-activated receptor gamma isoform 2
Type:
Nuclear Receptor
Mol. Mass.:
57613.46
Organism:
Homo sapiens (Human)
Description:
P37231
Residue:
505
  
Inhibitor
Name:
BDBM50471948
Synonyms:
CHEMBL149647
Type:
Small organic molecule
Emp. Form.:
C36H35N3O5
Mol. Mass.:
589.6802
SMILES:
COCn1c(CCOc2ccc(C[C@H](Nc3ccccc3C(=O)c3ccccc3)C(O)=O)cc2)c(C)nc1-c1ccccc1
: