Target
Peroxisome proliferator-activated receptor gamma
Ligand
BDBM50085046
Substrate
Meas. Tech.
ChEMBL_154525 (CHEMBL762152)
Ki
3.7±n/a nM
Citation
 Cobb, JEBlanchard, SGBoswell, EGBrown, KKCharifson, PSCooper, JPCollins, JLDezube, MHenke, BRHull-Ryde, EALake, DHLenhard, JMOliver, WOplinger, JPentti, MParks, DJPlunket, KDTong, WQ N-(2-Benzoylphenyl)-L-tyrosine PPARgamma agonists. 3. Structure-activity relationship and optimization of the N-aryl substituent. J Med Chem 41:5055-69 (1998)  
Target
Name:
Peroxisome proliferator-activated receptor gamma
Synonyms:
NR1C3 PPAR-gamma PPARG_HUMAN Peroxisome proliferator-activated receptor gamma (PPAR gamma) Peroxisome proliferator-activated receptor gamma (PPARĪ³) peroxisome proliferator-activated receptor gamma isoform 2
Type:
Nuclear Receptor
Mol. Mass.:
57613.46
Organism:
Homo sapiens (Human)
Description:
P37231
Residue:
505
  
Inhibitor
Name:
BDBM50085046
Synonyms:
2-((S)-1-carboxy-2-{4-[2-(5-methyl-2-phenyl-oxazol-4-yl)-ethoxy]-phenyl}-ethylamino)-benzoic acid methyl ester CHEMBL106666
Type:
Small organic molecule
Emp. Form.:
C29H28N2O6
Mol. Mass.:
500.5424
SMILES:
COC(=O)c1ccccc1N[C@@H](Cc1ccc(OCCc2nc(oc2C)-c2ccccc2)cc1)C(O)=O
: