Target
Peroxisome proliferator-activated receptor gamma
Ligand
BDBM50472048
Substrate
Meas. Tech.
ChEMBL_154525 (CHEMBL762152)
Ki
2.3±n/a nM
Citation
 Cobb, JEBlanchard, SGBoswell, EGBrown, KKCharifson, PSCooper, JPCollins, JLDezube, MHenke, BRHull-Ryde, EALake, DHLenhard, JMOliver, WOplinger, JPentti, MParks, DJPlunket, KDTong, WQ N-(2-Benzoylphenyl)-L-tyrosine PPARgamma agonists. 3. Structure-activity relationship and optimization of the N-aryl substituent. J Med Chem 41:5055-69 (1998)  
Target
Name:
Peroxisome proliferator-activated receptor gamma
Synonyms:
NR1C3 PPAR-gamma PPARG_HUMAN Peroxisome proliferator-activated receptor gamma (PPAR gamma) Peroxisome proliferator-activated receptor gamma (PPARĪ³) peroxisome proliferator-activated receptor gamma isoform 2
Type:
Nuclear Receptor
Mol. Mass.:
57613.46
Organism:
Homo sapiens (Human)
Description:
P37231
Residue:
505
  
Inhibitor
Name:
BDBM50472048
Synonyms:
CHEMBL146562
Type:
Small organic molecule
Emp. Form.:
C30H27N3O5S
Mol. Mass.:
541.617
SMILES:
CN(CCOc1ccc(CC(Nc2ccccc2C(=O)c2ccsc2)C(O)=O)cc1)c1nc2ccccc2o1
: