Target
Alpha-2A adrenergic receptor
Ligand
BDBM50027012
Substrate
Meas. Tech.
ChEBML_33031
Ki
390±n/a nM
Citation
 Saari, WSHalczenko, WKing, SWHuff, JRGuare, JPHunt, CARandall, WCAnderson, PSLotti, VJTaylor, DA Pyridinylpiperazines, a new class of selective alpha 2-adrenoceptor antagonists. J Med Chem 26:1696-701 (1984)  
Target
Name:
Alpha-2A adrenergic receptor
Synonyms:
ADA2A_BOVIN Alpha-2A adrenergic receptor Alpha-2A adrenoreceptor Alpha-2D adrenergic receptor Cerebral cortex alpha adrenergic receptor adrenergic Alpha2D
Type:
Enzyme Catalytic Domain
Mol. Mass.:
49275.13
Organism:
BOVINE
Description:
adrenergic Alpha2 0 BOVINE::Q28838
Residue:
452
  
Inhibitor
Name:
BDBM50027012
Synonyms:
1-(3-Chloro-pyridin-4-yl)-piperazine | CHEMBL47740
Type:
Small organic molecule
Emp. Form.:
C9H12ClN3
Mol. Mass.:
197.665
SMILES:
Clc1cnccc1N1CCNCC1
: