Target
Alpha-1A adrenergic receptor
Ligand
BDBM50027014
Substrate
Meas. Tech.
ChEBML_33092
Ki
215±n/a nM
Citation
 Saari, WSHalczenko, WKing, SWHuff, JRGuare, JPHunt, CARandall, WCAnderson, PSLotti, VJTaylor, DA Pyridinylpiperazines, a new class of selective alpha 2-adrenoceptor antagonists. J Med Chem 26:1696-701 (1984)  
Target
Name:
Alpha-1A adrenergic receptor
Synonyms:
ADA1A_BOVIN ADRA1C Alpha 1A-adrenoreceptor Cerebral cortex alpha adrenergic receptor | adrenergic Alpha1
Type:
Enzyme Catalytic Domain
Mol. Mass.:
51492.08
Organism:
CALF
Description:
adrenergic Alpha1 0 CALF
Residue:
466
  
Inhibitor
Name:
BDBM50027014
Synonyms:
1-(3-Chloro-pyridin-2-yl)-4-methyl-piperazine | CHEMBL47415
Type:
Small organic molecule
Emp. Form.:
C10H14ClN3
Mol. Mass.:
211.691
SMILES:
CN1CCN(CC1)c1ncccc1Cl
: