Target
Sodium-dependent dopamine transporter
Ligand
BDBM50018648
Substrate
Meas. Tech.
ChEMBL_62785 (CHEMBL858763)
Ki
562±n/a nM
Citation
 Hoffman, BTKopajtic, TKatz, JLNewman, AH 2D QSAR modeling and preliminary database searching for dopamine transporter inhibitors using genetic algorithm variable selection of Molconn Z descriptors. J Med Chem 43:4151-9 (2000)  
Target
Name:
Sodium-dependent dopamine transporter
Synonyms:
DA transporter SC6A3_RAT Sodium-dependent dopamine transporter | Sodium-dependent dopamine transporter (DAT)
Type:
Multi-pass membrane protein
Mol. Mass.:
68749.45
Organism:
Rattus norvegicus (rat)
Description:
P23977
Residue:
619
  
Inhibitor
Name:
BDBM50018648
Synonyms:
4-(1-Propyl-piperidin-3-yl)-phenol | CHEMBL305438
Type:
Small organic molecule
Emp. Form.:
C14H21NO
Mol. Mass.:
219.3226
SMILES:
CCCN1CCCC(C1)c1ccc(O)cc1
: